Reaction Details
TargetAlpha-1D adrenergic receptor
LigandBDBM50082795
Substrate/Competitorn/a
Meas. Tech.ChEMBL_32451 (CHEMBL643399)
Ki 220±n/a nM
Citation Nagarathnam, DMiao, SWLagu, BChiu, GFang, JMurali Dhar, TGZhang, JTyagarajan, SMarzabadi, MRZhang, FWong, WCSun, WTian, DWetzel, JMForray, CChang, RSBroten, TPRansom, RWSchorn, TWChen, TBO'Malley, SKling, PSchneck, KBendesky, RHarrell, CM Design and synthesis of novel alpha(1)(a) adrenoceptor-selective antagonists. 1. Structure-activity relationship in dihydropyrimidinones. J Med Chem42:4764-77 (1999) Alpha-1D adrenergic receptor
Name:Alpha-1D adrenergic receptor
Type:Enzyme Catalytic Domain
Mol. Mass.:60485.82
Organism:Homo sapiens (Human)
Description:adrenergic Alpha1D ADRA1D HUMAN::P25100
Residue:572
BDBM50082795
NameBDBM50082795
Synonyms:3-[3-(4-Methoxycarbonyl-4-phenyl-piperidin-1-yl)-propylcarbamoyl]-6-methyl-2-oxo-4-p-tolyl-1,2,3,4-tetrahydro-pyrimidine-5-carboxylic acid methyl ester | CHEMBL359173
TypeSmall organic molecule
Emp. Form.C31H38N4O6
Mol. Mass.562.6566
SMILESCOC(=O)C1=C(C)NC(=O)N(C1c1ccc(C)cc1)C(=O)NCCCN1CCC(CC1)(C(=O)OC)c1ccccc1