Reaction Details
TargetAlpha-1B adrenergic receptor
LigandBDBM50082866
Substrate/Competitorn/a
Meas. Tech.ChEMBL_34328 (CHEMBL648111)
Ki 480±n/a nM
Citation Wong, WCSun, WLagu, BTian, DMarzabadi, MRZhang, FNagarathnam, DMiao, SWWetzel, JMPeng, JForray, CChang, RSChen, TBRansom, RO'Malley, SBroten, TPKling, PVyas, KPZhang, KGluchowski, C Design and synthesis of novel alpha(1)(a) adrenoceptor-selective antagonists. 4. Structure-activity relationship in the dihydropyrimidine series. J Med Chem42:4804-13 (1999) Alpha-1B adrenergic receptor
Name:Alpha-1B adrenergic receptor
Type:Enzyme
Mol. Mass.:56862.13
Organism:Homo sapiens (Human)
Description:P35368
Residue:520
BDBM50082866
NameBDBM50082866
Synonyms:6-(3,4-Difluoro-phenyl)-1-[5-(4-methoxycarbonyl-4-phenyl-piperidin-1-yl)-pentyl]-2,4-dimethyl-1,6-dihydro-pyrimidine-5-carboxylic acid methyl ester | CHEMBL141322
TypeSmall organic molecule
Emp. Form.C32H39F2N3O4
Mol. Mass.567.6666
SMILESCOC(=O)C1=C(C)N=C(C)N(CCCCCN2CCC(CC2)(C(=O)OC)c2ccccc2)C1c1ccc(F)c(F)c1