Reaction Details
TargetAlpha-1D adrenergic receptor
LigandBDBM50082870
Substrate/Competitorn/a
Meas. Tech.ChEMBL_32430 (CHEMBL646092)
Ki 220±n/a nM
Citation Wong, WCSun, WLagu, BTian, DMarzabadi, MRZhang, FNagarathnam, DMiao, SWWetzel, JMPeng, JForray, CChang, RSChen, TBRansom, RO'Malley, SBroten, TPKling, PVyas, KPZhang, KGluchowski, C Design and synthesis of novel alpha(1)(a) adrenoceptor-selective antagonists. 4. Structure-activity relationship in the dihydropyrimidine series. J Med Chem42:4804-13 (1999) Alpha-1D adrenergic receptor
Name:Alpha-1D adrenergic receptor
Type:Enzyme Catalytic Domain
Mol. Mass.:60485.82
Organism:Homo sapiens (Human)
Description:adrenergic Alpha1D ADRA1D HUMAN::P25100
Residue:572
BDBM50082870
NameBDBM50082870
Synonyms:6-(3,4-Difluoro-phenyl)-2,4-dimethyl-1-[5-(4-phenyl-piperidin-1-yl)-pentyl]-1,6-dihydro-pyrimidine-5-carboxylic acid methyl ester | CHEMBL359421
TypeSmall organic molecule
Emp. Form.C30H37F2N3O2
Mol. Mass.509.6305
SMILESCOC(=O)C1=C(C)N=C(C)N(CCCCCN2CCC(CC2)c2ccccc2)C1c1ccc(F)c(F)c1