Reaction Details
TargetAlpha-1D adrenergic receptor
LigandBDBM50082872
Substrate/Competitorn/a
Meas. Tech.ChEMBL_32430 (CHEMBL646092)
Ki 120±n/a nM
Citation Wong, WCSun, WLagu, BTian, DMarzabadi, MRZhang, FNagarathnam, DMiao, SWWetzel, JMPeng, JForray, CChang, RSChen, TBRansom, RO'Malley, SBroten, TPKling, PVyas, KPZhang, KGluchowski, C Design and synthesis of novel alpha(1)(a) adrenoceptor-selective antagonists. 4. Structure-activity relationship in the dihydropyrimidine series. J Med Chem42:4804-13 (1999) Alpha-1D adrenergic receptor
Name:Alpha-1D adrenergic receptor
Type:Enzyme Catalytic Domain
Mol. Mass.:60485.82
Organism:Homo sapiens (Human)
Description:adrenergic Alpha1D ADRA1D HUMAN::P25100
Residue:572
BDBM50082872
NameBDBM50082872
Synonyms:6-(3,4-Difluoro-phenyl)-1-{5-[4-(2-methoxy-phenyl)-piperidin-1-yl]-pentyl}-2,4-dimethyl-1,6-dihydro-pyrimidine-5-carboxylic acid methyl ester | CHEMBL145770
TypeSmall organic molecule
Emp. Form.C31H39F2N3O3
Mol. Mass.539.6565
SMILESCOC(=O)C1=C(C)N=C(C)N(CCCCCN2CCC(CC2)c2ccccc2OC)C1c1ccc(F)c(F)c1