Reaction Details
TargetAlpha-1A adrenergic receptor
LigandBDBM50082865
Substrate/Competitorn/a
Meas. Tech.ChEMBL_33891 (CHEMBL645469)
Ki 0.33±n/a nM
Citation Wong, WCSun, WLagu, BTian, DMarzabadi, MRZhang, FNagarathnam, DMiao, SWWetzel, JMPeng, JForray, CChang, RSChen, TBRansom, RO'Malley, SBroten, TPKling, PVyas, KPZhang, KGluchowski, C Design and synthesis of novel alpha(1)(a) adrenoceptor-selective antagonists. 4. Structure-activity relationship in the dihydropyrimidine series. J Med Chem42:4804-13 (1999) Alpha-1A adrenergic receptor
Name:Alpha-1A adrenergic receptor
Type:Cell-surface receptors
Mol. Mass.:51511.67
Organism:Homo sapiens (Human)
Description:P35348
Residue:466
BDBM50082865
NameBDBM50082865
Synonyms:6-(3,4-Difluoro-phenyl)-1-[5-(4,4-diphenyl-piperidin-1-yl)-pentyl]-2,4-dimethyl-1,6-dihydro-pyrimidine-5-carboxylic acid methyl ester | CHEMBL145746
TypeSmall organic molecule
Emp. Form.C36H41F2N3O2
Mol. Mass.585.7264
SMILESCOC(=O)C1=C(C)N=C(C)N(CCCCCN2CCC(CC2)(c2ccccc2)c2ccccc2)C1c1ccc(F)c(F)c1