Reaction Details
TargetAlpha-1D adrenergic receptor
LigandBDBM50082876
Substrate/Competitorn/a
Meas. Tech.ChEMBL_32430 (CHEMBL646092)
Ki 910±n/a nM
Citation Wong, WCSun, WLagu, BTian, DMarzabadi, MRZhang, FNagarathnam, DMiao, SWWetzel, JMPeng, JForray, CChang, RSChen, TBRansom, RO'Malley, SBroten, TPKling, PVyas, KPZhang, KGluchowski, C Design and synthesis of novel alpha(1)(a) adrenoceptor-selective antagonists. 4. Structure-activity relationship in the dihydropyrimidine series. J Med Chem42:4804-13 (1999) Alpha-1D adrenergic receptor
Name:Alpha-1D adrenergic receptor
Type:Enzyme Catalytic Domain
Mol. Mass.:60485.82
Organism:Homo sapiens (Human)
Description:adrenergic Alpha1D ADRA1D HUMAN::P25100
Residue:572
BDBM50082876
NameBDBM50082876
Synonyms:6-(3,4-Difluoro-phenyl)-1-[(S)-5-(4-methoxycarbonyl-4-phenyl-piperidin-1-yl)-4-methyl-pentyl]-2,4-dimethyl-1,6-dihydro-pyrimidine-5-carboxylic acid methyl ester | CHEMBL357131
TypeSmall organic molecule
Emp. Form.C33H41F2N3O4
Mol. Mass.581.6931
SMILESCOC(=O)C1=C(C)N=C(C)N(CCC[C@H](C)CN2CCC(CC2)(C(=O)OC)c2ccccc2)C1c1ccc(F)c(F)c1