Reaction Details
TargetAlpha-1A adrenergic receptor
LigandBDBM50082863
Substrate/Competitorn/a
Meas. Tech.ChEMBL_33605 (CHEMBL876765)
Ki 0.50±n/a nM
Citation Wong, WCSun, WLagu, BTian, DMarzabadi, MRZhang, FNagarathnam, DMiao, SWWetzel, JMPeng, JForray, CChang, RSChen, TBRansom, RO'Malley, SBroten, TPKling, PVyas, KPZhang, KGluchowski, C Design and synthesis of novel alpha(1)(a) adrenoceptor-selective antagonists. 4. Structure-activity relationship in the dihydropyrimidine series. J Med Chem42:4804-13 (1999) Alpha-1A adrenergic receptor
Name:Alpha-1A adrenergic receptor
Type:Cell-surface receptors
Mol. Mass.:51511.67
Organism:Homo sapiens (Human)
Description:P35348
Residue:466
BDBM50082863
NameBDBM50082863
Synonyms:6-(3,4-Difluoro-phenyl)-1-{5-[4-(2-methoxycarbonyl-phenyl)-piperazin-1-yl]-pentyl}-2,4-dimethyl-1,6-dihydro-pyrimidine-5-carboxylic acid methyl ester | CHEMBL436407
TypeSmall organic molecule
Emp. Form.C31H38F2N4O4
Mol. Mass.568.6546
SMILESCOC(=O)C1=C(C)N=C(C)N(CCCCCN2CCN(CC2)c2ccccc2C(=O)OC)C1c1ccc(F)c(F)c1