Reaction Details
Target5-hydroxytryptamine receptor 3A/3B
LigandBDBM50083174
Substrate/Competitorn/a
Meas. Tech.ChEMBL_2986 (CHEMBL621503)
Ki 0.28±n/a nM
Citation López-Rodríguez, MLBenhamú, BMorcillo, MJTejada, IDOrensanz, LAlfaro, MJMartín, MI Benzimidazole derivatives. 2. Synthesis and structure-activity relationships of new azabicyclic benzimidazole-4-carboxylic acid derivatives with affinity for serotoninergic 5-HT(3) receptors. J Med Chem42:5020-8 (2000) 5-hydroxytryptamine receptor 3A/3B
Name:5-hydroxytryptamine receptor 3A/3B
Type:n/a
Mol. Mass.:n/a
Description:ASSAY_ID of EBI is 2974
Components:This complex has 2 components.
Component 1
Name:5-hydroxytryptamine receptor 3B
Synonyms:5HT3B_RAT Serotonin (5-HT) receptor
Type:PROTEIN
Mol. Mass.:50328.78
Organism:Rattus norvegicus
Description:EBI_11885
Residue:437
Component 2
Name:5-hydroxytryptamine receptor 3A
Synonyms:5-HT3 5HT3A_RAT Htr3 Serotonin (5-HT) receptor | Zacopride site-R
Type:Enzyme Catalytic Domain
Mol. Mass.:55428.70
Organism:RAT
Description:5-HT3 HTR3A RAT::P35563
Residue:483
BDBM50083174
NameBDBM50083174
Synonyms:6-Bromo-1H-benzoimidazole-4-carboxylic acid (1-aza-bicyclo[2.2.2]oct-3-yl)-amide | CHEMBL148080
TypeSmall organic molecule
Emp. Form.C15H17BrN4O
Mol. Mass.349.226
SMILESBrc1cc(C(=O)N[C@@H]2CN3CCC2CC3)c2[nH]cnc2c1