Reaction Details
Target5-hydroxytryptamine receptor 1A
LigandBDBM50083275
Substrate/Competitorn/a
Meas. Tech.ChEMBL_1432 (CHEMBL616306)
Ki 2.4±n/a nM
Citation Abou-Gharbia, MAChilders, WEFletcher, HMcGaughey, GPatel, UWebb, MBYardley, JAndree, TBoast, CKucharik, RJMarquis, KMorris, HScerni, RMoyer, JA Synthesis and SAR of adatanserin: novel adamantyl aryl- and heteroarylpiperazines with dual serotonin 5-HT(1A) and 5-HT(2) activity as potential anxiolytic and antidepressant agents. J Med Chem42:5077-94 (2000) 5-hydroxytryptamine receptor 1A
Name:5-hydroxytryptamine receptor 1A
Type:G Protein-Coupled Receptor (GPCR)
Mol. Mass.:46445.29
Organism:Rattus norvegicus (rat)
Description:Binding assays were performed using rat hippocampal membranes.
Residue:422
BDBM50083275
NameBDBM50083275
Synonyms:CHEMBL543927 | Hexahydro-2,5-methano-pentalene-3a-carboxylic acid [2-(4-pyrimidin-2-yl-piperazin-1-yl)-ethyl]-amide; dihydrochloride
TypeSmall organic molecule
Emp. Form.C20H29N5O
Mol. Mass.355.4772
SMILESO=C(NCCN1CCN(CC1)c1ncccn1)C12CC3C[C@@H]1C[C@@H](C2)C3