Reaction Details
Target5-hydroxytryptamine receptor 1A
LigandBDBM50083277
Substrate/Competitorn/a
Meas. Tech.ChEMBL_1432 (CHEMBL616306)
Ki 1±n/a nM
Citation Abou-Gharbia, MAChilders, WEFletcher, HMcGaughey, GPatel, UWebb, MBYardley, JAndree, TBoast, CKucharik, RJMarquis, KMorris, HScerni, RMoyer, JA Synthesis and SAR of adatanserin: novel adamantyl aryl- and heteroarylpiperazines with dual serotonin 5-HT(1A) and 5-HT(2) activity as potential anxiolytic and antidepressant agents. J Med Chem42:5077-94 (2000) 5-hydroxytryptamine receptor 1A
Name:5-hydroxytryptamine receptor 1A
Type:G Protein-Coupled Receptor (GPCR)
Mol. Mass.:46445.29
Organism:Rattus norvegicus (rat)
Description:Binding assays were performed using rat hippocampal membranes.
Residue:422
BDBM50083277
NameBDBM50083277
Synonyms:Adamantane-1-carboxylic acid {2-[4-(2-methoxy-phenyl)-piperazin-1-yl]-ethyl}-amide; Dihydrochloride | CHEMBL539818
TypeSmall organic molecule
Emp. Form.C24H35N3O2
Mol. Mass.397.5536
SMILESCOc1ccccc1N1CCN(CCNC(=O)C23C[C@H]4C[C@H](C[C@H](C4)C2)C3)CC1