Reaction Details
TargetNeuraminidase
LigandBDBM50083324
Substrate/Competitorn/a
Meas. Tech.ChEMBL_144589 (CHEMBL749506)
Ki 40±n/a nM
Citation Wall, IDLeach, ARSalt, DWFord, MGEssex, JW Binding constants of neuraminidase inhibitors: An investigation of the linear interaction energy method. J Med Chem42:5142-52 (2000) Neuraminidase
Name:Neuraminidase
Type:Enzyme
Mol. Mass.:50124.14
Organism:Influenza A virus (A/Puerto Rico/8/34/Mount Sinai(H1N1))
Description:P03468
Residue:454
BDBM50083324
NameBDBM50083324
Synonyms:(2R,3R,4S)-3-Acetylamino-6-dihydroxymethyl-2-((R)-1,2,3-trihydroxy-propyl)-3,4-dihydro-2H-pyran-4-yl-ammonium
TypeSmall organic molecule
Emp. Form.C11H21N2O7
Mol. Mass.293.2931
SMILESCC(=O)N[C@@H]1[C@@H]([NH3+])C=C(O[C@H]1C(O)[C@H](O)CO)C(O)O