Reaction Details
TargetNeuraminidase
LigandBDBM50083333
Substrate/Competitorn/a
Meas. Tech.ChEMBL_144589 (CHEMBL749506)
Ki 1±n/a nM
Citation Wall, IDLeach, ARSalt, DWFord, MGEssex, JW Binding constants of neuraminidase inhibitors: An investigation of the linear interaction energy method. J Med Chem42:5142-52 (2000) Neuraminidase
Name:Neuraminidase
Type:Enzyme
Mol. Mass.:50124.14
Organism:Influenza A virus (A/Puerto Rico/8/34/Mount Sinai(H1N1))
Description:P03468
Residue:454
BDBM50083333
NameBDBM50083333
Synonyms:CHEMBL348207 | N-[6-Dihydroxymethyl-4-guanidino-2-(1,2,3-trihydroxy-propyl)-3,4-dihyd ro-2H-pyran-3-yl]-acetamide
TypeSmall organic molecule
Emp. Form.C12H22N4O7
Mol. Mass.334.3257
SMILES[#6]-[#6](=O)-[#7]-[#6@@H]-1-[#6@H](-[#6]=[#6](-[#8]-[#6@H]-1-[#6](-[#8])-[#6@H](-[#8])-[#6]-[#8])-[#6](-[#8])-[#8])\[#7]=[#6](\[#7])-[#7]