Reaction Details
TargetD(2) dopamine receptor
LigandBDBM85093
Substrate/Competitorn/a
Meas. Tech.ChEMBL_60058 (CHEMBL671372)
Ki 908±n/a nM
Citation Belliotti, TRWustrow, DJBrink, WAZoski, KTShih, YHWhetzel, SZGeorgic, LMCorbin, AEAkunne, HCHeffner, TGPugsley, TAWise, LD A series of 6- and 7-piperazinyl- and -piperidinylmethylbenzoxazinones with dopamine D4 antagonist activity: discovery of a potential atypical antipsychotic agent. J Med Chem42:5181-7 (2000) D(2) dopamine receptor
Name:D(2) dopamine receptor
Type:Cell-surface receptors
Mol. Mass.:50647.10
Organism:Homo sapiens (Human)
Description:P14416
Residue:443
BDBM85093
NameBDBM85093
Synonyms:CAS_3853 CHEMBL555670 NSC_3853
TypeSmall organic molecule
Emp. Form.C18H19ClN4
Mol. Mass.326.823
SMILESClc1ccc(cc1)N1CCN(Cc2c[nH]c3ncccc23)CC1