Reaction Details
TargetD(3) dopamine receptor
LigandBDBM85093
Substrate/Competitorn/a
Meas. Tech.ChEMBL_62112 (CHEMBL674990)
Ki>3030±n/a nM
Citation Belliotti, TRWustrow, DJBrink, WAZoski, KTShih, YHWhetzel, SZGeorgic, LMCorbin, AEAkunne, HCHeffner, TGPugsley, TAWise, LD A series of 6- and 7-piperazinyl- and -piperidinylmethylbenzoxazinones with dopamine D4 antagonist activity: discovery of a potential atypical antipsychotic agent. J Med Chem42:5181-7 (2000) D(3) dopamine receptor
Name:D(3) dopamine receptor
Type:n/a
Mol. Mass.:44243.43
Organism:Homo sapiens (Human)
Description:n/a
Residue:400
BDBM85093
NameBDBM85093
Synonyms:CAS_3853 CHEMBL555670 NSC_3853
TypeSmall organic molecule
Emp. Form.C18H19ClN4
Mol. Mass.326.823
SMILESClc1ccc(cc1)N1CCN(Cc2c[nH]c3ncccc23)CC1