Reaction Details
TargetNeprilysin
LigandBDBM50083378
Substrate/Competitorn/a
Meas. Tech.ChEMBL_144468 (CHEMBL755533)
Ki 17±n/a nM
Citation David, CBischoff, LMeudal, HMothé, ADe Mota, NDaNascimento, SLlorens-Cortes, CFournié-Zaluski, MCRoques, BP Investigation of subsite preferences in aminopeptidase A (EC 3.4.11.7) led to the design of the first highly potent and selective inhibitors of this enzyme. J Med Chem42:5197-211 (2000) Neprilysin
Name:Neprilysin
Type:Enzyme
Mol. Mass.:85570.75
Organism:Oryctolagus cuniculus (rabbit)
Description:NEP was purified to homogeneity from rabbit kidney.
Residue:750
BDBM50083378
NameBDBM50083378
Synonyms:1-{[1-(1-Carboxy-2-sulfo-ethylcarbamoyl)-2-methyl-butylcarbamoyl]-mercapto-methyl}-3-sulfo-propyl-ammonium | CHEMBL148777
TypeSmall organic molecule
Emp. Form.C14H27N3O10S3
Mol. Mass.493.573
SMILESCC[C@@H](C)[C@H](NC(=O)[C@H](S)[C@H]([NH3+])CCS([O-])(=O)=O)C(=O)N[C@@H](CS(O)(=O)=O)C(O)=O