Reaction Details
TargetGlutamyl aminopeptidase
LigandBDBM50083374
Substrate/Competitorn/a
Meas. Tech.ChEMBL_32830 (CHEMBL873060)
Ki 9.3±n/a nM
Citation David, CBischoff, LMeudal, HMothé, ADe Mota, NDaNascimento, SLlorens-Cortes, CFournié-Zaluski, MCRoques, BP Investigation of subsite preferences in aminopeptidase A (EC 3.4.11.7) led to the design of the first highly potent and selective inhibitors of this enzyme. J Med Chem42:5197-211 (2000) Glutamyl aminopeptidase
Name:Glutamyl aminopeptidase
Type:PROTEIN
Mol. Mass.:109226.47
Organism:Homo sapiens (Human)
Description:ChEMBL_32829
Residue:957
BDBM50083374
NameBDBM50083374
Synonyms:1-{[1-(1-Carboxy-3-sulfo-propylcarbamoyl)-2-(4-hydroxy-phenyl)-ethylcarbamoyl]-mercapto-methyl}-3-sulfo-propyl-ammonium | CHEMBL347763
TypeSmall organic molecule
Emp. Form.C18H27N3O11S3
Mol. Mass.557.615
SMILES[NH3+][C@H](CCS([O-])(=O)=O)[C@@H](S)C(=O)N[C@@H](Cc1ccc(O)cc1)C(=O)N[C@@H](CCS(O)(=O)=O)C(O)=O