Reaction Details
TargetGlutamyl aminopeptidase
LigandBDBM50083380
Substrate/Competitorn/a
Meas. Tech.ChEMBL_32830 (CHEMBL873060)
Ki 80±n/a nM
Citation David, CBischoff, LMeudal, HMothé, ADe Mota, NDaNascimento, SLlorens-Cortes, CFournié-Zaluski, MCRoques, BP Investigation of subsite preferences in aminopeptidase A (EC 3.4.11.7) led to the design of the first highly potent and selective inhibitors of this enzyme. J Med Chem42:5197-211 (2000) Glutamyl aminopeptidase
Name:Glutamyl aminopeptidase
Type:PROTEIN
Mol. Mass.:109226.47
Organism:Homo sapiens (Human)
Description:ChEMBL_32829
Residue:957
BDBM50083380
NameBDBM50083380
Synonyms:1-{[(1S,2R)-1-((S)-1,2-Dicarboxy-ethylcarbamoyl)-2-methyl-butylcarbamoyl]-mercapto-methyl}-3-sulfamoyl-propyl-ammonium
TypeSmall organic molecule
Emp. Form.C15H29N4O8S2
Mol. Mass.457.542
SMILESCC[C@@H](C)[C@H](NC(=O)C(S)C([NH3+])CCS(N)(=O)=O)C(=O)N[C@@H](CC(O)=O)C(O)=O