Reaction Details
TargetMuscarinic acetylcholine receptor M5
LigandBDBM50073468
Substrate/Competitorn/a
Meas. Tech.ChEMBL_139388 (CHEMBL747701)
IC50 194±n/a nM
Citation Augelli-Szafran, CEBlankley, CJJaen, JCMoreland, DWNelson, CBPenvose-Yi, JRSchwarz, RDThomas, AJ Identification and characterization of m1 selective muscarinic receptor antagonists1. J Med Chem42:356-63 (1999) 
 
Muscarinic acetylcholine receptor M5
Name:Muscarinic acetylcholine receptor M5
Type:PROTEIN
Mol. Mass.:60102.35
Organism:Homo sapiens (Human)
Description:ChEMBL_1517990
Residue:532
BDBM50073468
NameBDBM50073468
Synonyms:1-Ethyl-4-phenyl-1,2,5,6-tetrahydro-pyridine-3-carboxylic acid heptyl ester; oxalic acid | CHEMBL334245
TypeSmall organic molecule
Emp. Form.C21H31NO2
Mol. Mass.329.4763
SMILESCCCCCCCOC(=O)C1=C(CCN(CC)C1)c1ccccc1