Reaction Details
TargetMuscarinic acetylcholine receptor M1
LigandBDBM50073466
Substrate/Competitorn/a
Meas. Tech.ChEMBL_138287 (CHEMBL744319)
IC50 77±n/a nM
Citation Augelli-Szafran, CEBlankley, CJJaen, JCMoreland, DWNelson, CBPenvose-Yi, JRSchwarz, RDThomas, AJ Identification and characterization of m1 selective muscarinic receptor antagonists1. J Med Chem42:356-63 (1999) 
 
Muscarinic acetylcholine receptor M1
Name:Muscarinic acetylcholine receptor M1
Type:Protein
Mol. Mass.:51442.54
Organism:Homo sapiens (Human)
Description:P11229
Residue:460
BDBM50073466
NameBDBM50073466
Synonyms:1-Ethyl-4-phenyl-1,2,3,6-tetrahydro-pyridine-3-carboxylic acid butyl ester; oxalic acid | CHEMBL332181
TypeSmall organic molecule
Emp. Form.C18H25NO2
Mol. Mass.287.3966
SMILESCCCCOC(=O)C1CN(CC)CC=C1c1ccccc1