Reaction Details
TargetMuscarinic acetylcholine receptor M5
LigandBDBM50073496
Substrate/Competitorn/a
Meas. Tech.ChEMBL_139388 (CHEMBL747701)
IC50 401±n/a nM
Citation Augelli-Szafran, CEBlankley, CJJaen, JCMoreland, DWNelson, CBPenvose-Yi, JRSchwarz, RDThomas, AJ Identification and characterization of m1 selective muscarinic receptor antagonists1. J Med Chem42:356-63 (1999) 
 
Muscarinic acetylcholine receptor M5
Name:Muscarinic acetylcholine receptor M5
Type:PROTEIN
Mol. Mass.:60102.35
Organism:Homo sapiens (Human)
Description:ChEMBL_1517990
Residue:532
BDBM50073496
NameBDBM50073496
Synonyms:1-Ethyl-4-phenyl-1,2,3,6-tetrahydro-pyridine-3-carboxylic acid octyl ester; oxalic acid | CHEMBL118241
TypeSmall organic molecule
Emp. Form.C22H33NO2
Mol. Mass.343.5029
SMILESCCCCCCCCOC(=O)C1CN(CC)CC=C1c1ccccc1