Reaction Details
TargetMuscarinic acetylcholine receptor M3
LigandBDBM50073498
Substrate/Competitorn/a
Meas. Tech.ChEMBL_138585 (CHEMBL746513)
IC50 110±n/a nM
Citation Augelli-Szafran, CEBlankley, CJJaen, JCMoreland, DWNelson, CBPenvose-Yi, JRSchwarz, RDThomas, AJ Identification and characterization of m1 selective muscarinic receptor antagonists1. J Med Chem42:356-63 (1999) 
 
Muscarinic acetylcholine receptor M3
Name:Muscarinic acetylcholine receptor M3
Type:Enzyme
Mol. Mass.:66151.03
Organism:Homo sapiens (Human)
Description:P20309
Residue:590
BDBM50073498
NameBDBM50073498
Synonyms:1-Ethyl-4-phenyl-1,2,3,6-tetrahydro-pyridine-3-carboxylic acid cyclohexylmethyl ester; oxalic acid | CHEMBL330999
TypeSmall organic molecule
Emp. Form.C21H29NO2
Mol. Mass.327.4605
SMILESCCN1CC=C(C(C1)C(=O)OCC1CCCCC1)c1ccccc1