Reaction Details
TargetMuscarinic acetylcholine receptor M2
LigandBDBM50073469
Substrate/Competitorn/a
Meas. Tech.ChEMBL_139631 (CHEMBL748244)
IC50 53±n/a nM
Citation Augelli-Szafran, CEBlankley, CJJaen, JCMoreland, DWNelson, CBPenvose-Yi, JRSchwarz, RDThomas, AJ Identification and characterization of m1 selective muscarinic receptor antagonists1. J Med Chem42:356-63 (1999) 
 
Muscarinic acetylcholine receptor M2
Name:Muscarinic acetylcholine receptor M2
Type:GPCR
Mol. Mass.:51730.61
Organism:Homo sapiens (Human)
Description:P08172
Residue:466
BDBM50073469
NameBDBM50073469
Synonyms:1-Ethyl-4-phenyl-1,2,5,6-tetrahydro-pyridine-3-carboxylic acid octyl ester; oxalic acid | CHEMBL120080
TypeSmall organic molecule
Emp. Form.C22H33NO2
Mol. Mass.343.5029
SMILESCCCCCCCCOC(=O)C1=C(CCN(CC)C1)c1ccccc1