Reaction Details
TargetMuscarinic acetylcholine receptor M5
LigandBDBM50073503
Substrate/Competitorn/a
Meas. Tech.ChEMBL_139388 (CHEMBL747701)
IC50 54±n/a nM
Citation Augelli-Szafran, CEBlankley, CJJaen, JCMoreland, DWNelson, CBPenvose-Yi, JRSchwarz, RDThomas, AJ Identification and characterization of m1 selective muscarinic receptor antagonists1. J Med Chem42:356-63 (1999) 
 
Muscarinic acetylcholine receptor M5
Name:Muscarinic acetylcholine receptor M5
Type:PROTEIN
Mol. Mass.:60102.35
Organism:Homo sapiens (Human)
Description:ChEMBL_1517990
Residue:532
BDBM50073503
NameBDBM50073503
Synonyms:1-Ethyl-4-phenyl-1,2,5,6-tetrahydro-pyridine-3-carboxylic acid cyclohexyl ester; oxalic acid | CHEMBL332980
TypeSmall organic molecule
Emp. Form.C20H27NO2
Mol. Mass.313.4339
SMILESCCN1CCC(=C(C1)C(=O)OC1CCCCC1)c1ccccc1