Reaction Details
TargetMuscarinic acetylcholine receptor M1
LigandBDBM50073486
Substrate/Competitorn/a
Meas. Tech.ChEMBL_138287 (CHEMBL744319)
IC50 59±n/a nM
Citation Augelli-Szafran, CEBlankley, CJJaen, JCMoreland, DWNelson, CBPenvose-Yi, JRSchwarz, RDThomas, AJ Identification and characterization of m1 selective muscarinic receptor antagonists1. J Med Chem42:356-63 (1999) 
 
Muscarinic acetylcholine receptor M1
Name:Muscarinic acetylcholine receptor M1
Type:Protein
Mol. Mass.:51442.54
Organism:Homo sapiens (Human)
Description:P11229
Residue:460
BDBM50073486
NameBDBM50073486
Synonyms:1-Ethyl-4-phenyl-1,2,3,6-tetrahydro-pyridine-3-carboxylic acid 3-phenyl-propyl ester; hydrochloride | CHEMBL540316
TypeSmall organic molecule
Emp. Form.C23H27NO2
Mol. Mass.349.466
SMILESCCN1CC=C(C(C1)C(=O)OCCCc1ccccc1)c1ccccc1