Reaction Details
TargetMuscarinic acetylcholine receptor M4
LigandBDBM50073479
Substrate/Competitorn/a
Meas. Tech.ChEMBL_139113 (CHEMBL749237)
IC50 109±n/a nM
Citation Augelli-Szafran, CEBlankley, CJJaen, JCMoreland, DWNelson, CBPenvose-Yi, JRSchwarz, RDThomas, AJ Identification and characterization of m1 selective muscarinic receptor antagonists1. J Med Chem42:356-63 (1999) 
 
Muscarinic acetylcholine receptor M4
Name:Muscarinic acetylcholine receptor M4
Type:Enzyme Catalytic Domain
Mol. Mass.:53079.31
Organism:Homo sapiens (Human)
Description:Cholinergic, muscarinic M4 CHRM4 HUMAN M3::P08173
Residue:479
BDBM50073479
NameBDBM50073479
Synonyms:1-Ethyl-4-phenyl-1,2,3,6-tetrahydro-pyridine-3-carboxylic acid cyclohexyl ester; oxalic acid | CHEMBL324936
TypeSmall organic molecule
Emp. Form.C20H27NO2
Mol. Mass.313.4339
SMILESCCN1CC=C(C(C1)C(=O)OC1CCCCC1)c1ccccc1