Reaction Details
TargetTetanus toxin
LigandBDBM50073666
Substrate/Competitorn/a
Meas. Tech.ChEMBL_210251 (CHEMBL809278)
Ki 100000±n/a nM
Citation Martin, LCornille, FTurcaud, SMeudal, HRoques, BPFournié-Zaluski, MC Metallopeptidase inhibitors of tetanus toxin: A combinatorial approach. J Med Chem42:515-25 (1999) 
 
Tetanus toxin
Name:Tetanus toxin
Type:PROTEIN
Mol. Mass.:150674.51
Organism:Clostridium tetani
Description:ChEMBL_210251
Residue:1315
BDBM50073666
NameBDBM50073666
Synonyms:(R)-1-Mercaptomethyl-3-sulfamoyl-propyl-ammonium
TypeSmall organic molecule
Emp. Form.C4H13N2O2S2
Mol. Mass.185.288
SMILESNS(=O)(=O)CC[C@@H]([NH3+])CS