Reaction Details
TargetTetanus toxin
LigandBDBM50073670
Substrate/Competitorn/a
Meas. Tech.ChEMBL_210251 (CHEMBL809278)
Ki 4000±n/a nM
Citation Martin, LCornille, FTurcaud, SMeudal, HRoques, BPFournié-Zaluski, MC Metallopeptidase inhibitors of tetanus toxin: A combinatorial approach. J Med Chem42:515-25 (1999) 
 
Tetanus toxin
Name:Tetanus toxin
Type:PROTEIN
Mol. Mass.:150674.51
Organism:Clostridium tetani
Description:ChEMBL_210251
Residue:1315
BDBM50073670
NameBDBM50073670
Synonyms:(1R,2S)-2-[1-[1-Benzylcarbamoyl-2-(1H-imidazol-4-yl)-ethylcarbamoyl]-2-(4-hydroxy-phenyl)-ethylcarbamoyl]-2-mercapto-1-(3-sulfamoyl-phenyl)-ethyl-ammonium
TypeSmall organic molecule
Emp. Form.C31H36N7O6S2
Mol. Mass.666.79
SMILESNS(=O)(=O)c1cccc(c1)[C@@H]([NH3+])[C@H](S)C(=O)NC(Cc1ccc(O)cc1)C(=O)NC(Cc1cnc[nH]1)C(=O)NCc1ccccc1