Reaction Details
TargetTetanus toxin
LigandBDBM50073679
Substrate/Competitorn/a
Meas. Tech.ChEMBL_210251 (CHEMBL809278)
Ki 6800±n/a nM
Citation Martin, LCornille, FTurcaud, SMeudal, HRoques, BPFournié-Zaluski, MC Metallopeptidase inhibitors of tetanus toxin: A combinatorial approach. J Med Chem42:515-25 (1999) 
 
Tetanus toxin
Name:Tetanus toxin
Type:PROTEIN
Mol. Mass.:150674.51
Organism:Clostridium tetani
Description:ChEMBL_210251
Residue:1315
BDBM50073679
NameBDBM50073679
Synonyms:(S)-1-{(S)-[(S)-1-[(S)-1-Benzylcarbamoyl-2-(3H-imidazol-4-yl)-ethylcarbamoyl]-2-(4-hydroxy-phenyl)-ethylcarbamoyl]-mercapto-methyl}-3-sulfamoyl-propyl-ammonium
TypeSmall organic molecule
Emp. Form.C27H36N7O6S2
Mol. Mass.618.747
SMILESNS(=O)(=O)CC[C@H]([NH3+])[C@H](S)C(=O)N[C@@H](Cc1ccc(O)cc1)C(=O)N[C@@H](Cc1cnc[nH]1)C(=O)NCc1ccccc1