Reaction Details
TargetReverse transcriptase/RNaseH
LigandBDBM50369418
Substrate/Competitorn/a
Meas. Tech.ChEMBL_197263 (CHEMBL804179)
EC50 5.1±n/a nM
Citation Eriksson, MAPitera, JKollman, PA Prediction of the binding free energies of new TIBO-like HIV-1 reverse transcriptase inhibitors using a combination of PROFEC, PB/SA, CMC/MD, and free energy calculations. J Med Chem42:868-81 (1999) 
 
Reverse transcriptase/RNaseH
Name:Reverse transcriptase/RNaseH
Type:PROTEIN
Mol. Mass.:65229.15
Organism:Human immunodeficiency virus 1
Description:ChEMBL_1473730
Residue:566
BDBM50369418
NameBDBM50369418
Synonyms:CHEMBL58711 | R-87027
TypeSmall organic molecule
Emp. Form.C16H20ClN3S
Mol. Mass.321.868
SMILESC[C@H]1Cn2c3c(CN1CC=C(C)C)c(Cl)ccc3[nH]c2=S