Reaction Details
TargetNeuromedin-K receptor
LigandBDBM50408859
Substrate/Competitorn/a
Meas. Tech.ChEMBL_209565 (CHEMBL811267)
Ki 6.8±n/a nM
Citation Giardina, GARaveglia, LFGrugni, MSarau, HMFarina, CMedhurst, ADGraziani, DSchmidt, DBRigolio, RLuttmann, MCavagnera, SFoley, JJVecchietti, VHay, DW Discovery of a novel class of selective non-peptide antagonists for the human neurokinin-3 receptor. 2. Identification of (S)-N-(1-phenylpropyl)-3-hydroxy-2-phenylquinoline-4-carboxamide (SB 223412). J Med Chem42:1053-65 (1999) 
 
Neuromedin-K receptor
Name:Neuromedin-K receptor
Type:Enzyme
Mol. Mass.:52221.96
Organism:Homo sapiens (Human)
Description:P29371
Residue:465
BDBM50408859
NameBDBM50408859
Synonyms:CHEMBL2113681
TypeSmall organic molecule
Emp. Form.C31H33N3O2
Mol. Mass.479.6126
SMILESCC[C@H](NC(=O)c1c(OCCN2CCCC2)c(nc2ccccc12)-c1ccccc1)c1ccccc1