Reaction Details
TargetProgesterone receptor
LigandBDBM50062417
Substrate/Competitorn/a
Meas. Tech.ChEMBL_159054 (CHEMBL760106)
EC50 14±n/a nM
Citation Zhi, LTegley, CMMarschke, KBMais, DEJones, TK 5-Aryl-1,2,3,4-tetrahydrochromeno[3,4-f]quinolin-3-ones as a novel class of nonsteroidal progesterone receptor agonists: effect of A-ring modification. J Med Chem42:1466-72 (1999) 
 
Progesterone receptor
Name:Progesterone receptor
Type:Protein
Mol. Mass.:98979.52
Organism:Homo sapiens (Human)
Description:P06401
Residue:933
BDBM50062417
NameBDBM50062417
Synonyms:5-(4-Chloro-phenyl)-2,2,4-trimethyl-2,5-dihydro-1H-6-oxa-1-aza-chrysene | CHEMBL286595
TypeSmall organic molecule
Emp. Form.C25H22ClNO
Mol. Mass.387.901
SMILESCC1=CC(C)(C)Nc2ccc3-c4ccccc4OC(c4ccc(Cl)cc4)c3c12