Reaction Details
TargetP2Y purinoceptor 1
LigandBDBM50076462
Substrate/Competitorn/a
Meas. Tech.ChEMBL_147722 (CHEMBL759192)
IC50 449±n/a nM
Citation Nandanan, ECamaioni, EJang, SYKim, YCCristalli, GHerdewijn, PSecrist, JATiwari, KNMohanram, AHarden, TKBoyer, JLJacobson, KA Structure-activity relationships of bisphosphate nucleotide derivatives as P2Y1 receptor antagonists and partial agonists. J Med Chem42:1625-38 (1999) 
 
P2Y purinoceptor 1
Name:P2Y purinoceptor 1
Type:n/a
Mol. Mass.:41199.64
Organism:Meleagris gallopavo
Description:n/a
Residue:362
BDBM50076462
NameBDBM50076462
Synonyms:CHEMBL440662 | Phosphoric acid mono-[5-(6-methylamino-2-propylsulfanyl-purin-9-yl)-2-phosphonooxymethyl-tetrahydro-furan-3-yl] ester
TypeSmall organic molecule
Emp. Form.C14H23N5O9P2S
Mol. Mass.499.373
SMILESCCCSc1nc(NC)c2ncn(C3CC(OP(O)(O)=O)C(COP(O)(O)=O)O3)c2n1