Reaction Details
TargetP2Y purinoceptor 1
LigandBDBM50076463
Substrate/Competitorn/a
Meas. Tech.ChEMBL_147715 (CHEMBL759185)
EC50 6490±n/a nM
Citation Nandanan, ECamaioni, EJang, SYKim, YCCristalli, GHerdewijn, PSecrist, JATiwari, KNMohanram, AHarden, TKBoyer, JLJacobson, KA Structure-activity relationships of bisphosphate nucleotide derivatives as P2Y1 receptor antagonists and partial agonists. J Med Chem42:1625-38 (1999) 
 
P2Y purinoceptor 1
Name:P2Y purinoceptor 1
Type:n/a
Mol. Mass.:41199.64
Organism:Meleagris gallopavo
Description:n/a
Residue:362
BDBM50076463
NameBDBM50076463
Synonyms:CHEMBL295051 | Phosphoric acid mono-[4-(2-amino-6-methylamino-purin-9-yl)-2-phosphonooxymethyl-cyclopentyl] ester
TypeSmall organic molecule
Emp. Form.C12H20N6O8P2
Mol. Mass.438.2701
SMILESCNc1nc(N)nc2n(cnc12)C1CC(COP(O)(O)=O)C(C1)OP(O)(O)=O