Reaction Details
TargetDelta-type opioid receptor
LigandBDBM50076495
Substrate/Competitorn/a
Meas. Tech.ChEMBL_146924 (CHEMBL757316)
Ki 0.800000±n/a nM
Citation Coop, ARothman, RBDersch, CPartilla, JPorreca, FDavis, PJacobson, AERice, KC delta Opioid affinity and selectivity of 4-hydroxy-3-methoxyindolomorphinan analogues related to naltrindole. J Med Chem42:1673-9 (1999) 
 
Delta-type opioid receptor
Name:Delta-type opioid receptor
Type:G Protein-Coupled Receptor (GPCR)
Mol. Mass.:40465.04
Organism:Rattus norvegicus (rat)
Description:Competition binding assays were using CHO-K1 cell membranes expressing the opioid receptor.
Residue:372
BDBM50076495
NameBDBM50076495
Synonyms:16-methoxy-22-methyl-(13R)-14-oxa-11,22-diazaheptacyclo[13.9.1.01,13.02,21.04,12.05,10.019,25]pentacosa-4(12),5(10),6,8,15(25),16,18-heptaen-2-ol | CHEMBL44910
TypeSmall organic molecule
Emp. Form.C24H24N2O3
Mol. Mass.388.459
SMILESCOc1ccc2C[C@H]3N(C)CC[C@@]45[C@@H](Oc1c24)c1[nH]c2ccccc2c1C[C@@]35O