Reaction Details
TargetGamma-aminobutyric acid receptor subunit alpha-3/beta-3/gamma-2
LigandBDBM50083908
Substrate/Competitorn/a
Meas. Tech.ChEMBL_70416 (CHEMBL682251)
Ki 0.20±n/a nM
Citation Huang, QHe, XMa, CLiu, RYu, SDayer, CAWenger, GRMcKernan, RCook, JM Pharmacophore/receptor models for GABA(A)/BzR subtypes (alpha1beta3gamma2, alpha5beta3gamma2, and alpha6beta3gamma2) via a comprehensive ligand-mapping approach. J Med Chem43:71-95 (2000) Gamma-aminobutyric acid receptor subunit alpha-3/beta-3/gamma-2
Name:Gamma-aminobutyric acid receptor subunit alpha-3/beta-3/gamma-2
Type:n/a
Mol. Mass.:n/a
Description:ASSAY_ID of EBI is 68410
Components:This complex has 3 components.
Component 1
Name:Gamma-aminobutyric acid receptor subunit gamma-2
Synonyms:GABA(A) receptor subunit gamma-2 GBRG2_HUMAN
Type:PROTEIN
Mol. Mass.:54172.74
Organism:Homo sapiens (Human)
Description:EBI_217
Residue:467
Component 2
Name:Gamma-aminobutyric acid receptor subunit beta-3
Synonyms:GABA A receptor alpha-4/beta-3/gamma-2 GABA-A receptor GBRB3_HUMAN | agonist GABA site
Type:PROTEIN
Mol. Mass.:54130.51
Organism:Homo sapiens (Human)
Description:ChEMBL_448071
Residue:473
Component 3
Name:Gamma-aminobutyric acid receptor subunit alpha-3
Synonyms:GABA A Alpha3Beta3Gamma2 GABA C GABA-A receptor GBRA3_HUMAN agonist GABA site
Type:Enzyme Catalytic Domain
Mol. Mass.:55175.47
Organism:Homo sapiens (Human)
Description:GABA A Alpha3Beta1Gamma2 0 HUMAN::P34903
Residue:492
BDBM50083908
NameBDBM50083908
Synonyms:8-Bromo-7-oxo-3b,4,5,6-tetrahydro-7H-2,6a,11b-triaza-benzo[g]cyclopenta[e]azulene-3-carboxylic acid tert-butyl ester CHEMBL366947
TypeSmall organic molecule
Emp. Form.C19H20BrN3O3
Mol. Mass.418.284
SMILESCC(C)(C)OC(=O)c1ncn-2c1[C@@H]1CCCN1C(=O)c1c(Br)cccc-21