Reaction Details
TargetGag-Pol polyprotein
LigandBDBM50065787
Substrate/Competitorn/a
Meas. Tech.ChEMBL_88784 (CHEMBL699442)
IC50 65100.00±n/a nM
Citation Ouali, MLaboulais, CLeh, HGill, DDesmaële, DMekouar, KZouhiri, Fd'Angelo, JAuclair, CMouscadet, JFLe Bret, M Modeling of the inhibition of retroviral integrases by styrylquinoline derivatives. J Med Chem43:1949-57 (2000) Gag-Pol polyprotein
Name:Gag-Pol polyprotein
Type:PROTEIN
Mol. Mass.:173907.80
Organism:Rous sarcoma virus (strain Prague C) (RSV-PrC)
Description:ChEMBL_88784
Residue:1603
BDBM50065787
NameBDBM50065787
Synonyms:4-(2-(8-hydroxyquinolin-2-yl)vinyl)benzene-1,2-diol 4-[2-(8-Hydroxy-quinolin-2-yl)-vinyl]-benzene-1,2-diol | CHEMBL58057
TypeSmall organic molecule
Emp. Form.C17H13NO3
Mol. Mass.279.29
SMILESOc1ccc(\C=C\c2ccc3cccc(O)c3n2)cc1O