Reaction Details
TargetGag-Pol polyprotein
LigandBDBM50065791
Substrate/Competitorn/a
Meas. Tech.ChEMBL_88784 (CHEMBL699442)
IC50>100000.00±n/a nM
Citation Ouali, MLaboulais, CLeh, HGill, DDesmaële, DMekouar, KZouhiri, Fd'Angelo, JAuclair, CMouscadet, JFLe Bret, M Modeling of the inhibition of retroviral integrases by styrylquinoline derivatives. J Med Chem43:1949-57 (2000) Gag-Pol polyprotein
Name:Gag-Pol polyprotein
Type:PROTEIN
Mol. Mass.:173907.80
Organism:Rous sarcoma virus (strain Prague C) (RSV-PrC)
Description:ChEMBL_88784
Residue:1603
BDBM50065791
NameBDBM50065791
Synonyms:4-[(E)-2-(8-Amino-quinolin-2-yl)-vinyl]-benzene-1,2-diol CHEMBL58191
TypeSmall organic molecule
Emp. Form.C17H14N2O2
Mol. Mass.278.3053
SMILESNc1cccc2ccc(\C=C\c3ccc(O)c(O)c3)nc12