Reaction Details
TargetSodium-dependent serotonin transporter
LigandBDBM50088336
Substrate/Competitorn/a
Meas. Tech.ChEMBL_201973 (CHEMBL804975)
Ki 20.0±n/a nM
Citation Hoepping, AJohnson, KMGeorge, CFlippen-Anderson, JKozikowski, AP Novel conformationally constrained tropane analogues by 6-endo-trig radical cyclization and stille coupling - switch of activity toward the serotonin and/or norepinephrine transporter. J Med Chem43:2064-71 (2000) Sodium-dependent serotonin transporter
Name:Sodium-dependent serotonin transporter
Type:Multi-pass membrane protein
Mol. Mass.:70168.43
Organism:Rattus norvegicus (rat)
Description:P31652
Residue:630
BDBM50088336
NameBDBM50088336
Synonyms:9-(3,4-Dichloro-benzylidene)-7-aza-tricyclo[4.3.1.0*3,7*]decane-2-carboxylic acid methyl ester | CHEMBL304656
TypeSmall organic molecule
Emp. Form.C18H19Cl2NO2
Mol. Mass.352.255
SMILESCOC(=O)[C@H]1C2CC[C@@H]3C[C@@H]1\C(CN23)=C\c1ccc(Cl)c(Cl)c1