Reaction Details
TargetIntegrase
LigandBDBM50088348
Substrate/Competitorn/a
Meas. Tech.ChEMBL_88615 (CHEMBL701719)
IC50 23900±n/a nM
Citation Carlson, HAMasukawa, KMRubins, KBushman, FDJorgensen, WLLins, RDBriggs, JMMcCammon, JA Developing a dynamic pharmacophore model for HIV-1 integrase. J Med Chem43:2100-14 (2000) Integrase
Name:Integrase
Synonyms:Human immunodeficiency virus type 1 integrase
Type:PROTEIN
Mol. Mass.:32231.48
Organism:Human immunodeficiency virus 1
Description:ChEMBL_90865
Residue:288
BDBM50088348
NameBDBM50088348
TypeSmall organic molecule
Emp. Form.C14H12N2O4
Mol. Mass.272.2561
SMILESOc1cccc(\C=N\N=C\c2cccc(O)c2O)c1O