Reaction Details
TargetIntegrase
LigandBDBM50088350
Substrate/Competitorn/a
Meas. Tech.ChEMBL_88615 (CHEMBL701719)
IC50 1200±n/a nM
Citation Carlson, HAMasukawa, KMRubins, KBushman, FDJorgensen, WLLins, RDBriggs, JMMcCammon, JA Developing a dynamic pharmacophore model for HIV-1 integrase. J Med Chem43:2100-14 (2000) Integrase
Name:Integrase
Synonyms:Human immunodeficiency virus type 1 integrase
Type:PROTEIN
Mol. Mass.:32231.48
Organism:Human immunodeficiency virus 1
Description:ChEMBL_90865
Residue:288
BDBM50088350
NameBDBM50088350
TypeSmall organic molecule
Emp. Form.C29H34N3O8
Mol. Mass.552.5961
SMILESCN(C)[C@H]1[C@@H]2C[C@H]3C(C(=O)C2C(=O)C(C(=O)NNC2(CCCC2)C([O-])=O)C1=O)C(=O)c1c(C)cccc1C3(C)O