Reaction Details
TargetIntegrase
LigandBDBM50133496
Substrate/Competitorn/a
Meas. Tech.ChEMBL_88615 (CHEMBL701719)
IC50 9000±n/a nM
Citation Carlson, HAMasukawa, KMRubins, KBushman, FDJorgensen, WLLins, RDBriggs, JMMcCammon, JA Developing a dynamic pharmacophore model for HIV-1 integrase. J Med Chem43:2100-14 (2000) Integrase
Name:Integrase
Synonyms:Human immunodeficiency virus type 1 integrase
Type:PROTEIN
Mol. Mass.:32231.48
Organism:Human immunodeficiency virus 1
Description:ChEMBL_90865
Residue:288
BDBM50133496
NameBDBM50133496
TypeSmall organic molecule
Emp. Form.C18H16O8
Mol. Mass.360.3148
SMILESOC(=O)[C@@H](Cc1ccc(O)c(O)c1)OC(=O)\C=C\c1ccc(O)c(O)c1