Reaction Details
TargetIntegrase
LigandBDBM5149
Substrate/Competitorn/a
Meas. Tech.ChEMBL_88616 (CHEMBL701720)
IC50 3000±n/a nM
Citation Carlson, HAMasukawa, KMRubins, KBushman, FDJorgensen, WLLins, RDBriggs, JMMcCammon, JA Developing a dynamic pharmacophore model for HIV-1 integrase. J Med Chem43:2100-14 (2000) Integrase
Name:Integrase
Synonyms:Human immunodeficiency virus type 1 integrase
Type:PROTEIN
Mol. Mass.:32231.48
Organism:Human immunodeficiency virus 1
Description:ChEMBL_90865
Residue:288
BDBM5149
NameBDBM5149
TypeSmall organic molecule
Emp. Form.C23H20N4O6
Mol. Mass.448.4281
SMILESOc1ccc(\C=C(/C#N)C(=O)NCCCNC(=O)C(=C\c2ccc(O)c(O)c2)\C#N)cc1O