Reaction Details
TargetIntegrase
LigandBDBM67690
Substrate/Competitorn/a
Meas. Tech.ChEMBL_88615 (CHEMBL701719)
IC50 3800±n/a nM
Citation Carlson, HAMasukawa, KMRubins, KBushman, FDJorgensen, WLLins, RDBriggs, JMMcCammon, JA Developing a dynamic pharmacophore model for HIV-1 integrase. J Med Chem43:2100-14 (2000) Integrase
Name:Integrase
Synonyms:Human immunodeficiency virus type 1 integrase
Type:PROTEIN
Mol. Mass.:32231.48
Organism:Human immunodeficiency virus 1
Description:ChEMBL_90865
Residue:288
BDBM67690
NameBDBM67690
TypeSmall organic molecule
Emp. Form.C22H28N4O6
Mol. Mass.444.4809
SMILESOCCNCCNc1ccc(NCCNCCO)c2C(=O)c3c(O)ccc(O)c3C(=O)c12