Reaction Details
TargetKappa-type opioid receptor
LigandBDBM50088380
Substrate/Competitorn/a
Meas. Tech.ChEMBL_146677 (CHEMBL753169)
Ki 1±n/a nM
Citation Lavecchia, AGreco, GNovellino, EVittorio, FRonsisvalle, G Modeling of kappa-opioid receptor/agonists interactions using pharmacophore-based and docking simulations. J Med Chem43:2124-34 (2000) Kappa-type opioid receptor
Name:Kappa-type opioid receptor
Type:G Protein-Coupled Receptor (GPCR)
Mol. Mass.:42744.99
Organism:Cavia porcellus (domestic guinea pig)
Description:P41144
Residue:380
BDBM50088380
NameBDBM50088380
Synonyms:1-(1-{[2-(3,4-Dichloro-phenyl)-acetyl]-methyl-amino}-6-hydroxy-1,2,3,4-tetrahydro-naphthalen-2-yl)-pyrrolidinium
TypeSmall organic molecule
Emp. Form.C23H27Cl2N2O2
Mol. Mass.434.378
SMILESCN([C@@H]1[C@H](CCc2cc(O)ccc12)[NH+]1CCCC1)C(=O)Cc1ccc(Cl)c(Cl)c1