Reaction Details
TargetAdenosine receptor A1
LigandBDBM50088424
Substrate/Competitorn/a
Meas. Tech.ChEMBL_28397 (CHEMBL636816)
EC50 100±n/a nM
Citation Jacobson, KAJi, XLi, AHMelman, NSiddiqui, MAShin, KJMarquez, VERavi, RG Methanocarba analogues of purine nucleosides as potent and selective adenosine receptor agonists. J Med Chem43:2196-203 (2000) Adenosine receptor A1
Name:Adenosine receptor A1
Type:Protein
Mol. Mass.:36704.13
Organism:Rattus norvegicus (rat)
Description:n/a
Residue:326
BDBM50088424
NameBDBM50088424
Synonyms:(1R,2R,3S,4R,5S)-4-(6-Cyclopentylamino-purin-9-yl)-1-hydroxymethyl-bicyclo[3.1.0]hexane-2,3-diol CHEMBL27952
TypeSmall organic molecule
Emp. Form.C17H23N5O3
Mol. Mass.345.3962
SMILESOC[C@@]12C[C@@H]1[C@H]([C@H](O)[C@@H]2O)n1cnc2c(NC3CCCC3)ncnc12