Reaction Details
TargetPeptide deformylase
LigandBDBM50089194
Substrate/Competitorn/a
Meas. Tech.ChEMBL_154575 (CHEMBL761923)
IC50 6±n/a nM
Citation Apfel, CBanner, DWBur, DDietz, MHirata, THubschwerlen, CLocher, HPage, MGPirson, WRossé, GSpecklin, JL Hydroxamic acid derivatives as potent peptide deformylase inhibitors and antibacterial agents. J Med Chem43:2324-31 (2000) Peptide deformylase
Name:Peptide deformylase
Type:n/a
Mol. Mass.:16901.39
Organism:Escherichia coli
Description:n/a
Residue:150
BDBM50089194
NameBDBM50089194
Synonyms:(R)-N*4*-Hydroxy-N*1*-[(S)-1-((S)-2-hydroxymethyl-pyrrolidine-1-carbonyl)-2-methyl-propyl]-2-pentyl-succinamide ACTINONIN N*4*-Hydroxy-N*1*-[(S)-1-((S)-2-hydroxymethyl-pyrrolidine-1-carbonyl)-2-methyl-propyl]-2-(R)-pentyl-succinamide | N*4*-Hydroxy-N*1*-[1-(2-hydroxymethyl-pyrrolidine-1-carbonyl)-2-methyl-propyl]-2-pentyl-succinamide
TypeSmall organic molecule
Emp. Form.C19H35N3O5
Mol. Mass.385.4983
SMILESCCCCC[C@H](CC(=O)NO)C(=O)N[C@@H](C(C)C)C(=O)N1CCC[C@H]1CO