Reaction Details
TargetSodium/potassium-transporting ATPase subunit alpha-1
LigandBDBM50408918
Substrate/Competitorn/a
Meas. Tech.ChEMBL_144088 (CHEMBL750866)
IC50>100000±n/a nM
Citation Cerri, AAlmirante, NBarassi, PBenicchio, AFedrizzi, GFerrari, PMicheletti, RQuadri, LRagg, ERossi, RSantagostino, MSchiavone, ASerra, FZappavigna, MPMelloni, P 17beta-O-Aminoalkyloximes of 5beta-androstane-3beta,14beta-diol with digitalis-like activity: synthesis, cardiotonic activity, structure-activity relationships, and molecular modeling of the Na(+),K(+)-ATPase receptor. J Med Chem43:2332-49 (2000) Sodium/potassium-transporting ATPase subunit alpha-1
Name:Sodium/potassium-transporting ATPase subunit alpha-1
Type:PROTEIN
Mol. Mass.:112656.60
Organism:Canis familiaris
Description:ChEMBL_144092
Residue:1021
BDBM50408918
NameBDBM50408918
Synonyms:CHEMBL2068898 | CHEMBL2068976
TypeSmall organic molecule
Emp. Form.C20H33NO3
Mol. Mass.335.4809
SMILESC[C@]12CC[C@H]3[C@@H](CC[C@@H]4C[C@@H](O)CC[C@]34C)[C@@]1(O)CC[C@@H]2CN=O