Reaction Details
TargetCholecystokinin receptor type A
LigandBDBM50089268
Substrate/Competitorn/a
Meas. Tech.ChEMBL_47646 (CHEMBL657358)
Ki 0.05±n/a nM
Citation Pierson, MEComstock, JMSimmons, RDJulien, RKaiser, FRosamond, JD CCK peptides with combined features of hexa- and tetrapeptide CCK-A agonists. J Med Chem43:2350-5 (2000) Cholecystokinin receptor type A
Name:Cholecystokinin receptor type A
Type:Enzyme Catalytic Domain
Mol. Mass.:49676.37
Organism:RAT
Description:Cholecystokinin central 0 RAT::P30551
Residue:444
BDBM50089268
NameBDBM50089268
Synonyms:CHEMBL267861 | N-(1-Carbamoyl-2-phenyl-ethyl)-3-{2-[2-(2-{2-[2-(4-hydroxy-phenyl)-acetylamino]-hexanoylamino}-acetylamino)-3-(1H-indol-3-yl)-propionylamino]-6-[3-(2-methyl-benzoyl)-ureido]-hexanoylamino}-N-methyl-succinamic acid
TypeSmall organic molecule
Emp. Form.C56H68N10O12
Mol. Mass.1073.1989
SMILESCCCCC(NC(=O)Cc1ccc(O)cc1)C(=O)NCC(=O)NC(Cc1c[nH]c2ccccc12)C(=O)NC(CCCCNC(=O)NC(=O)c1ccccc1C)C(=O)NC(CC(O)=O)C(=O)N(C)C(Cc1ccccc1)C(N)=O