Reaction Details
TargetCholecystokinin receptor type A
LigandBDBM50061828
Substrate/Competitorn/a
Meas. Tech.ChEMBL_47646 (CHEMBL657358)
Ki 0.03±n/a nM
Citation Pierson, MEComstock, JMSimmons, RDJulien, RKaiser, FRosamond, JD CCK peptides with combined features of hexa- and tetrapeptide CCK-A agonists. J Med Chem43:2350-5 (2000) Cholecystokinin receptor type A
Name:Cholecystokinin receptor type A
Type:Enzyme Catalytic Domain
Mol. Mass.:49676.37
Organism:RAT
Description:Cholecystokinin central 0 RAT::P30551
Residue:444
BDBM50061828
NameBDBM50061828
Synonyms:CHEMBL76248 N-(1-Carbamoyl-2-phenyl-ethyl)-3-({2-[3-(1H-indol-3-yl)-2-(2-{2-[2-(4-sulfooxy-phenyl)-acetylamino]-hexanoylamino}-acetylamino)-propionylamino]-hexanoyl}-methyl-amino)-succinamic acid ; ammonium base (AR-R 15849)
TypeSmall organic molecule
Emp. Form.C47H60N8O13S
Mol. Mass.977.09
SMILESCCCC[C@H](NC(=O)Cc1ccc(OS(O)(=O)=O)cc1)C(=O)NCC(=O)N[C@@H](Cc1c[nH]c2ccccc12)C(=O)N[C@@H](CCCC)C(=O)N(C)[C@@H](CC(O)=O)C(=O)N[C@@H](Cc1ccccc1)C(N)=O