Reaction Details
TargetCholecystokinin receptor type A
LigandBDBM50089277
Substrate/Competitorn/a
Meas. Tech.ChEMBL_47646 (CHEMBL657358)
Ki 4.2±n/a nM
Citation Pierson, MEComstock, JMSimmons, RDJulien, RKaiser, FRosamond, JD CCK peptides with combined features of hexa- and tetrapeptide CCK-A agonists. J Med Chem43:2350-5 (2000) Cholecystokinin receptor type A
Name:Cholecystokinin receptor type A
Type:Enzyme Catalytic Domain
Mol. Mass.:49676.37
Organism:RAT
Description:Cholecystokinin central 0 RAT::P30551
Residue:444
BDBM50089277
NameBDBM50089277
Synonyms:CHEMBL311187 | N-(1-Carbamoyl-2-phenyl-ethyl)-3-({2-[2-(2-{2-[2-(4-hydroxy-phenyl)-acetylamino]-hexanoylamino}-acetylamino)-3-(1H-indol-3-yl)-propionylamino]-hexanoyl}-methyl-amino)-succinamic acid
TypeSmall organic molecule
Emp. Form.C47H60N8O10
Mol. Mass.897.0269
SMILESCCCCC(NC(=O)Cc1ccc(O)cc1)C(=O)NCC(=O)NC(Cc1c[nH]c2ccccc12)C(=O)NC(CCCC)C(=O)N(C)C(CC(O)=O)C(=O)NC(Cc1ccccc1)C(N)=O